Примечание. Android.enableAapt2 = false устарело и будет удалено к концу 2018 года, так что это не решит проблему, это всего лишь временное решение

переноса моего существующего проекта вAndroid Studio 3.0не компилируется. Ниже приведены данные журнала:

Error:java.util.concurrent.ExecutionException: 
    java.util.concurrent.ExecutionException: 
com.android.tools.aapt2.Aapt2Exception: AAPT2 error: check logs for details
Error:java.util.concurrent.ExecutionException: 
com.android.tools.aapt2.Aapt2Exception: AAPT2 error: check logs for details
Error:com.android.tools.aapt2.Aapt2Exception: AAPT2 error: check logs for 
details
Error:Execution failed for task ':app:processDebugResources'.
Failed to execute aapt
Information:BUILD FAILED in 27s
Information:11 errors
Information:0 warnings
 Izabela Orlowska16 нояб. 2017 г., 20:13
Не могли бы вы добавить журналы? Должна быть настоящая ошибка AAPT чуть выше трассировки стека.
 namsnath26 дек. 2017 г., 11:58
Я обнаружил, что простая перестройка также исправила ошибку для меня. Сначала я попробовал решения, приведенные ниже, и перестроил его. Я удалил это и восстановил снова, и это все еще работало.
 namsnath26 дек. 2017 г., 13:10
Обновление: ошибка вернулась, думаю, я просто отключу aapt2 снова

Ответы на вопрос(3)

ь папку ресурсов .gradle в настройках на путь, который не содержит символов кириллицы. В->Settings-> Build, Execution -> Gradle менятьService directory path в "C: /Users/Public/.gradle"

 Kaeptm Blaubaer07 апр. 2018 г., 18:21
Если вы не можете найти gradle.properties в своем проекте, просто создайте его как пустой файл в каталоге верхнего уровня проекта и добавьте в него настройку.
 Scott Johansen02 февр. 2018 г., 03:15
У меня также есть не английский язык на моем пути, и у меня та же проблема. Когда я попробовал ваше предложение, я получил много ошибок, таких какerror: resource android:attr/fontStyle not found. При осмотре я вижу, что каталог .gradle занимает более 900 МБ. Я не могу добавить предложенную строку вgradle.properties потому что я не такой файл в одном из моих проектов. Там еще один называетсяsettings.gradle но добавление строки дает другие ошибки.
Решение Вопроса

Перейти к вашейgradle.properties напишите приведенный ниже код и синхронизируйте ваш проект

android.enableAapt2=false

 yahme315 нояб. 2018 г., 10:06
Process 'command 'C:\Users\PC\AppData\Local\Android\Sdk\build-tools\26.0.2\aapt.exe'' finished with non-zero exit value 1 после применения вышеуказанного метода. Есть предположения?

1: - удалите все ненужные файлы XML из вашего кода

2: - вновь открыть и проверить файлы XML

Если проблема не устранена

Перейдите в свой gradle.properties и напишите следующий код

android.enableAapt2=false 

а затем перейдите в свой build.gradle (приложение), напишите приведенный ниже код и синхронизируйте ваш проект

aaptOptions {
        cruncherEnabled = false
    }

Примечание. Android.enableAapt2 = false устарело и будет удалено к концу 2018 года, так что это не решит проблему, это всего лишь временное решение

Ваш ответ на вопрос